Personal tools
You are here: Home Forum Install & build make error on salome kernel with gentoo

make error on salome kernel with gentoo

Up to Install & build
  • make error on salome kernel with gentoo

    Posted by RobertoA at January 18. 2006
    Hello I found this error during make. Someone can help me? Thank you /usr/include/pthread.h:175: error: previous declaration of `void pthread_exit(void*)' /home/babar/Download/Aster/SALOME-2.2.8/installazione/KERNEL_SRC_2.2.8/src/SALOM ETraceCollector/SALOMETraceCollector.cxx:247: warning: converting to non-pointer type `int' from NULL /home/babar/Download/Aster/SALOME-2.2.8/installazione/KERNEL_SRC_2.2.8/src/SALOM ETraceCollector/SALOMETraceCollector.cxx:248: error: syntax error before `}' token make[3]: *** [SALOMETraceCollector.lo] Error 1 make[3]: Leaving directory `/home/babar/Download/Aster/SALOME-2.2.8/installazion e/KERNEL_build/src/SALOMETraceCollector' make[2]: *** [lib_SALOMETraceCollector] Error 2 make[2]: Leaving directory `/home/babar/Download/Aster/SALOME-2.2.8/installazion e/KERNEL_build/src' make[1]: *** [lib_src] Error 2 make[1]: Leaving directory `/home/babar/Download/Aster/SALOME-2.2.8/installazion e/KERNEL_build' make: *** [all] Error 2
Powered by Ploneboard
Document Actions