Personal tools
You are here: Home Forum Install & build SALOME_Component.hh: No such file or directory

SALOME_Component.hh: No such file or directory

Up to Install & build
  • SALOME_Component.hh: No such file or directory

    Posted by Jeff Shanab at March 19. 2006
    I am building salome and all dependencies by writing ebuilds for my amd64 gentoo system.
    I got a lot furthor last night, enought to have to let it go while I slept, but it got hung up on the above mentioned file.

    In file included from ../../include/salome/SALOME_LifeCycleCORBA.hxx:37,
                     from ../../include/salome/QAD_Desktop.h:41,
                     from SalomePy.cxx:38:
    ./SALOME_ContainerManager.hh:24:31: SALOME_Component.hh: No such file or directory
    In file included from ../../include/salome/SALOME_LifeCycleCORBA.hxx:37,
                     from ../../include/salome/QAD_Desktop.h:41,
                     from SalomePy.cxx:38:
    ./SALOME_ContainerManager.hh:260: error: `Container_ptr' does not name a type
    ./SALOME_ContainerManager.hh:298: error: `Container_ptr' does not name a type
    In file included from ../../include/salome/QAD_Desktop.h:41,
                     from SalomePy.cxx:38:
    ../../include/salome/SALOME_LifeCycleCORBA.hxx:47: error: using-declaration for non-member at class scope
    ../../include/salome/SALOME_LifeCycleCORBA.hxx:47: error: expected `;' before "FindContainer"
    ../../include/salome/SALOME_LifeCycleCORBA.hxx:48: error: using-declaration for non-member at class scope
    ../../include/salome/SALOME_LifeCycleCORBA.hxx:48: error: expected `;' before "FindOrLoad_Component"
    ../../include/salome/SALOME_LifeCycleCORBA.hxx:50: error: using-declaration for non-member at class scope
    ../../include/salome/SALOME_LifeCycleCORBA.hxx:50: error: expected `;' before "FindOrLoad_Component"
    ../../include/salome/SALOME_LifeCycleCORBA.hxx:56: error: using-declaration for non-member at class scope
    ../../include/salome/SALOME_LifeCycleCORBA.hxx:56: error: expected `;' before "FindComponent"
    ../../include/salome/SALOME_LifeCycleCORBA.hxx:60: error: using-declaration for non-member at class scope
    ../../include/salome/SALOME_LifeCycleCORBA.hxx:60: error: expected `;' before "LoadComponent"
    ../../include/salome/SALOME_LifeCycleCORBA.hxx:70: error: using-declaration for non-member at class scope
    ../../include/salome/SALOME_LifeCycleCORBA.hxx:70: error: expected `;' before "FindOrStartContainer"
    In file included from SalomePy.cxx:38:
    ../../include/salome/QAD_Desktop.h:172: error: using-declaration for non-member at class scope
    ../../include/salome/QAD_Desktop.h:172: error: expected `;' before "getEngine"
    make[3]: *** [SalomePy.lo] Error 1
    make[3]: Leaving directory `/var/tmp/portage/salomekernel-2.2.8/work/KERNEL_SRC_2.2.8/src/SALOME_PY'
    make[2]: *** [lib_SALOME_PY] Error 2
    make[2]: Leaving directory `/var/tmp/portage/salomekernel-2.2.8/work/KERNEL_SRC_2.2.8/src'
    make[1]: *** [lib_src] Error 2
    make[1]: Leaving directory `/var/tmp/portage/salomekernel-2.2.8/work/KERNEL_SRC_2.2.8'
    make: *** [all] Error 2

    • Re: SALOME_Component.hh: No such file or directory

      Posted by Etienne Lorriaux at April 11. 2006
      The file SALOME_Component.hh is missing in the SALOME_PY directory. Try to copy it from another directory (this file appears in others directories), or link it.
Powered by Ploneboard
Document Actions